Reaction Details
TargetAcetylcholinesterase
LigandBDBM31904
Substrate/Competitorn/a
Meas. Tech.ChEMBL_462138 (CHEMBL945911)
IC50 12600±n/a nM
Citation Cavalli, ABolognesi, MLMinarini, ARosini, MTumiatti, VRecanatini, MMelchiorre, C Multi-target-directed ligands to combat neurodegenerative diseases. J Med Chem51:347-72 (2008) 
 
Acetylcholinesterase
Name:Acetylcholinesterase
Type:Enzyme
Mol. Mass.:67792.70
Organism:Homo sapiens (Human)
Description:P22303
Residue:614
BDBM31904
NameBDBM31904
Synonyms:CHEMBL345124 Propidium Iodide, 2 | propidium iodide
TypeSmall organic molecule
Emp. Form.C27H34N4
Mol. Mass.414.5846
SMILESCC[N+](C)(CC)CCCn1c(-c2ccccc2)c2cc(N)ccc2c2ccc(=[NH2+])cc12