Reaction Details
TargetAmine oxidase [flavin-containing] A
LigandBDBM50231957
Substrate/Competitorn/a
Meas. Tech.ChEMBL_462120 (CHEMBL945894)
IC50 1120±n/a nM
Citation Cavalli, ABolognesi, MLMinarini, ARosini, MTumiatti, VRecanatini, MMelchiorre, C Multi-target-directed ligands to combat neurodegenerative diseases. J Med Chem51:347-72 (2008) 
 
Amine oxidase [flavin-containing] A
Name:Amine oxidase [flavin-containing] A
Type:Protein
Mol. Mass.:59689.53
Organism:Homo sapiens (Human)
Description:P21397
Residue:527
BDBM50231957
NameBDBM50231957
Synonyms:7-(3-Chloro-benzyloxy)-3,4-dimethyl-chromen-2-one CHEMBL109018
TypeSmall organic molecule
Emp. Form.C18H15ClO3
Mol. Mass.314.763
SMILESCc1c(C)c(=O)oc2cc(OCc3cccc(Cl)c3)ccc12