Reaction Details
TargetAmine oxidase [flavin-containing] A
LigandBDBM50231956
Substrate/Competitorn/a
Meas. Tech.ChEMBL_462120 (CHEMBL945894)
IC50 540±n/a nM
Citation Cavalli, ABolognesi, MLMinarini, ARosini, MTumiatti, VRecanatini, MMelchiorre, C Multi-target-directed ligands to combat neurodegenerative diseases. J Med Chem51:347-72 (2008) 
 
Amine oxidase [flavin-containing] A
Name:Amine oxidase [flavin-containing] A
Type:Protein
Mol. Mass.:59689.53
Organism:Homo sapiens (Human)
Description:P21397
Residue:527
BDBM50231956
NameBDBM50231956
Synonyms:(Z)-8-bromo-4-methyl-3-(methylimino)-1,2,3,4-tetrahydrocyclopenta[b]indol-7-yl dimethylcarbamate Dimethyl-carbamic acid 8-bromo-4-methyl-3-[(Z)-methylimino]-1,2,3,4-tetrahydro-cyclopenta[b]indol-7-yl ester
TypeSmall organic molecule
Emp. Form.C16H18BrN3O2
Mol. Mass.364.237
SMILESCN=C1CCc2c1n(C)c1ccc(OC(=O)N(C)C)c(Br)c21