Reaction Details
TargetAcetylcholinesterase
LigandBDBM50231961
Substrate/Competitorn/a
Meas. Tech.ChEMBL_462117 (CHEMBL945890)
IC50 952±n/a nM
Citation Cavalli, ABolognesi, MLMinarini, ARosini, MTumiatti, VRecanatini, MMelchiorre, C Multi-target-directed ligands to combat neurodegenerative diseases. J Med Chem51:347-72 (2008) 
 
Acetylcholinesterase
Name:Acetylcholinesterase
Type:Enzyme
Mol. Mass.:67792.70
Organism:Homo sapiens (Human)
Description:P22303
Residue:614
BDBM50231961
NameBDBM50231961
Synonyms:3,8-diamino-5-(3-{3-[3-(2-methoxy-benzylamino)-propylamino]-propylamino}-propyl)-6-phenyl-phenanthridinium | CHEMBL257540
TypeSmall organic molecule
Emp. Form.C36H45N6O
Mol. Mass.577.7816
SMILESCOc1ccccc1CNCCCNCCCNCCCn1c(-c2ccccc2)c2cc(N)ccc2c2ccc(=[NH2+])cc12