Reaction Details
TargetProcathepsin L
LigandBDBM50214542
Substrate/Competitorn/a
Meas. Tech.ChEMBL_462247 (CHEMBL945081)
IC50 67±n/a nM
Citation Gauthier, JYChauret, NCromlish, WDesmarais, SDuong, le TFalgueyret, JPKimmel, DBLamontagne, SLéger, SLeRiche, TLi, CSMassé, FMcKay, DJNicoll-Griffith, DAOballa, RMPalmer, JTPercival, MDRiendeau, DRobichaud, JRodan, GARodan, SBSeto, CThérien, MTruong, VLVenuti, MCWesolowski, GYoung, RNZamboni, RBlack, WC The discovery of odanacatib (MK-0822), a selective inhibitor of cathepsin K. Bioorg Med Chem Lett18:923-8 (2008) 
 
Procathepsin L
Name:Procathepsin L
Type:Enzyme
Mol. Mass.:37557.19
Organism:Homo sapiens (Human)
Description:Purchased from Calbiochem (San Diego, CA).
Residue:333
BDBM50214542
NameBDBM50214542
Synonyms:(S)-4-methyl-2-[(S)-2,2,2-trifluoro-1-(4'-methanesulfonyl-biphenyl-4-yl)-ethylamino]-pentanoic acid ((S)-benzyl-cyano-methyl)-amide | CHEMBL399361
TypeSmall organic molecule
Emp. Form.C30H32F3N3O3S
Mol. Mass.571.654
SMILESCC(C)C[C@H](N[C@@H](c1ccc(cc1)-c1ccc(cc1)S(C)(=O)=O)C(F)(F)F)C(=O)N[C@@H](Cc1ccccc1)C#N