Reaction Details
TargetCathepsin S
LigandBDBM50255753
Substrate/Competitorn/a
Meas. Tech.ChEMBL_462248 (CHEMBL945082)
IC50 60±n/a nM
Citation Gauthier, JYChauret, NCromlish, WDesmarais, SDuong, le TFalgueyret, JPKimmel, DBLamontagne, SLéger, SLeRiche, TLi, CSMassé, FMcKay, DJNicoll-Griffith, DAOballa, RMPalmer, JTPercival, MDRiendeau, DRobichaud, JRodan, GARodan, SBSeto, CThérien, MTruong, VLVenuti, MCWesolowski, GYoung, RNZamboni, RBlack, WC The discovery of odanacatib (MK-0822), a selective inhibitor of cathepsin K. Bioorg Med Chem Lett18:923-8 (2008) 
 
Cathepsin S
Name:Cathepsin S
Type:Protein
Mol. Mass.:37507.38
Organism:Homo sapiens (Human)
Description:P25774
Residue:331
BDBM50255753
NameBDBM50255753
Synonyms:CHEMBL481611 Odanacatib
TypeSmall organic molecule
Emp. Form.C25H27F4N3O3S
Mol. Mass.525.559
SMILESCC(C)(F)C[C@H](N[C@@H](c1ccc(cc1)-c1ccc(cc1)S(C)(=O)=O)C(F)(F)F)C(=O)NC1(CC1)C#N