Reaction Details
TargetNeuraminidase
LigandBDBM50233740
Substrate/Competitorn/a
Meas. Tech.ChEMBL_462436 (CHEMBL927252)
Ki 12±n/a nM
Citation Krueger, ACXu, YKati, WMKempf, DJMaring, CJMcDaniel, KFMolla, AMontgomery, DKohlbrenner, WE Synthesis of potent pyrrolidine influenza neuraminidase inhibitors. Bioorg Med Chem Lett18:1692-5 (2008) 
 
Neuraminidase
Name:Neuraminidase
Type:Enzyme
Mol. Mass.:51446.67
Organism:Influenza B virus (B/Lee/40)
Description:n/a
Residue:466
BDBM50233740
NameBDBM50233740
Synonyms:(2R,4S,5R)-5-((1R,2S)-1-acetamido-2-hydroxyhexyl)-4-(prop-1-enyl)pyrrolidine-2-carboxylic acid | CHEMBL400495
TypeSmall organic molecule
Emp. Form.C16H28N2O4
Mol. Mass.312.4045
SMILESCCCC[C@H](O)[C@H](NC(C)=O)[C@@H]1N[C@H](C[C@H]1\C=C/C)C(O)=O