Reaction Details
TargetSodium channel protein type 9 subunit alpha
LigandBDBM50233771
Substrate/Competitorn/a
Meas. Tech.ChEMBL_462438 (CHEMBL927254)
IC50 83±n/a nM
Citation London, CHoyt, SBParsons, WHWilliams, BSWarren, VATschirret-Guth, RSmith, MMPriest, BTMcGowan, EMartin, WJLyons, KALi, XKaranam, BVJochnowitz, NGarcia, MLFelix, JPDean, BAbbadie, CKaczorowski, GJDuffy, JL Imidazopyridines: a novel class of hNav1.7 channel blockers. Bioorg Med Chem Lett18:1696-701 (2008) 
 
Sodium channel protein type 9 subunit alpha
Name:Sodium channel protein type 9 subunit alpha
Type:Protein
Mol. Mass.:226375.97
Organism:Homo sapiens (Human)
Description:Q15858
Residue:1988
BDBM50233771
NameBDBM50233771
Synonyms:(R)-tert-butyl 1-((3-neopentyl-3H-imidazo[4,5-b]pyridin-2-yl)methylamino)-1-oxo-3-(2-(trifluoromethyl)phenyl)propan-2-ylcarbamate | CHEMBL399569
TypeSmall organic molecule
Emp. Form.C27H34F3N5O3
Mol. Mass.533.5858
SMILESCC(C)(C)Cn1c(CNC(=O)[C@@H](Cc2ccccc2C(F)(F)F)NC(=O)OC(C)(C)C)nc2cccnc12