Reaction Details
TargetC-X-C chemokine receptor type 2
LigandBDBM50236296
Substrate/Competitorn/a
Meas. Tech.ChEMBL_462971 (CHEMBL928889)
IC50 90±n/a nM
Citation Winters, MPCrysler, CSubasinghe, NRyan, DLeong, LZhao, SDonatelli, RYurkow, EMazzulla, MBoczon, LManthey, CLMolloy, CRaymond, HMurray, LMcAlonan, LTomczuk, B Carboxylic acid bioisosteres acylsulfonamides, acylsulfamides, and sulfonylureas as novel antagonists of the CXCR2 receptor. Bioorg Med Chem Lett18:1926-30 (2008) 
 
C-X-C chemokine receptor type 2
Name:C-X-C chemokine receptor type 2
Type:Protein
Mol. Mass.:40767.88
Organism:Homo sapiens (Human)
Description:P25025
Residue:360
BDBM50236296
NameBDBM50236296
Synonyms:1-(2-(5-bromo-2-(4-fluorophenyl)-1H-indol-3-yl)ethyl)-3-(methylsulfonyl)urea | CHEMBL404661
TypeSmall organic molecule
Emp. Form.C18H17BrFN3O3S
Mol. Mass.454.313
SMILESCS(=O)(=O)NC(=O)NCCc1c([nH]c2ccc(Br)cc12)-c1ccc(F)cc1