Reaction Details
TargetC-X-C chemokine receptor type 2
LigandBDBM50236298
Substrate/Competitorn/a
Meas. Tech.ChEMBL_462970 (CHEMBL928888)
IC50 1400±n/a nM
Citation Winters, MPCrysler, CSubasinghe, NRyan, DLeong, LZhao, SDonatelli, RYurkow, EMazzulla, MBoczon, LManthey, CLMolloy, CRaymond, HMurray, LMcAlonan, LTomczuk, B Carboxylic acid bioisosteres acylsulfonamides, acylsulfamides, and sulfonylureas as novel antagonists of the CXCR2 receptor. Bioorg Med Chem Lett18:1926-30 (2008) 
 
C-X-C chemokine receptor type 2
Name:C-X-C chemokine receptor type 2
Type:Protein
Mol. Mass.:40767.88
Organism:Homo sapiens (Human)
Description:P25025
Residue:360
BDBM50236298
NameBDBM50236298
Synonyms:CHEMBL404062 | N-(benzylsulfonyl)-4-(5-cyano-2-(4-fluorophenyl)-1H-indol-3-yl)butanamide
TypeSmall organic molecule
Emp. Form.C26H22FN3O3S
Mol. Mass.475.535
SMILESFc1ccc(cc1)-c1[nH]c2ccc(cc2c1CCCC(=O)NS(=O)(=O)Cc1ccccc1)C#N