Reaction Details
TargetC-X-C chemokine receptor type 2
LigandBDBM50236311
Substrate/Competitorn/a
Meas. Tech.ChEMBL_462970 (CHEMBL928888)
IC50 170±n/a nM
Citation Winters, MPCrysler, CSubasinghe, NRyan, DLeong, LZhao, SDonatelli, RYurkow, EMazzulla, MBoczon, LManthey, CLMolloy, CRaymond, HMurray, LMcAlonan, LTomczuk, B Carboxylic acid bioisosteres acylsulfonamides, acylsulfamides, and sulfonylureas as novel antagonists of the CXCR2 receptor. Bioorg Med Chem Lett18:1926-30 (2008) 
 
C-X-C chemokine receptor type 2
Name:C-X-C chemokine receptor type 2
Type:Protein
Mol. Mass.:40767.88
Organism:Homo sapiens (Human)
Description:P25025
Residue:360
BDBM50236311
NameBDBM50236311
Synonyms:4-(5-bromo-2-(4-fluorophenyl)-1H-indol-3-yl)-N-(methylsulfonyl)butanamide | CHEMBL255481
TypeSmall organic molecule
Emp. Form.C19H18BrFN2O3S
Mol. Mass.453.325
SMILESCS(=O)(=O)NC(=O)CCCc1c([nH]c2ccc(Br)cc12)-c1ccc(F)cc1