Reaction Details
TargetC-X-C chemokine receptor type 2
LigandBDBM50236305
Substrate/Competitorn/a
Meas. Tech.ChEMBL_462972 (CHEMBL928890)
IC50 2100±n/a nM
Citation Winters, MPCrysler, CSubasinghe, NRyan, DLeong, LZhao, SDonatelli, RYurkow, EMazzulla, MBoczon, LManthey, CLMolloy, CRaymond, HMurray, LMcAlonan, LTomczuk, B Carboxylic acid bioisosteres acylsulfonamides, acylsulfamides, and sulfonylureas as novel antagonists of the CXCR2 receptor. Bioorg Med Chem Lett18:1926-30 (2008) 
 
C-X-C chemokine receptor type 2
Name:C-X-C chemokine receptor type 2
Type:PROTEIN
Mol. Mass.:40639.60
Organism:Oryctolagus cuniculus
Description:ChEMBL_462972
Residue:358
BDBM50236305
NameBDBM50236305
Synonyms:4-(5-cyano-2-(4-fluorophenyl)-1H-indol-3-yl)-N-(methylsulfonyl)butanamide | CHEMBL440405
TypeSmall organic molecule
Emp. Form.C20H18FN3O3S
Mol. Mass.399.439
SMILESCS(=O)(=O)NC(=O)CCCc1c([nH]c2ccc(cc12)C#N)-c1ccc(F)cc1