Reaction Details
TargetC-X-C chemokine receptor type 2
LigandBDBM50236317
Substrate/Competitorn/a
Meas. Tech.ChEMBL_462970 (CHEMBL928888)
IC50 57±n/a nM
Citation Winters, MPCrysler, CSubasinghe, NRyan, DLeong, LZhao, SDonatelli, RYurkow, EMazzulla, MBoczon, LManthey, CLMolloy, CRaymond, HMurray, LMcAlonan, LTomczuk, B Carboxylic acid bioisosteres acylsulfonamides, acylsulfamides, and sulfonylureas as novel antagonists of the CXCR2 receptor. Bioorg Med Chem Lett18:1926-30 (2008) 
 
C-X-C chemokine receptor type 2
Name:C-X-C chemokine receptor type 2
Type:Protein
Mol. Mass.:40767.88
Organism:Homo sapiens (Human)
Description:P25025
Residue:360
BDBM50236317
NameBDBM50236317
Synonyms:4-[5-cyano-2-(4-fluorophenyl)-6-methoxy-1H-indol-3-yl]-N-(dimethylsulfamoyl)butanamide | CHEMBL254567
TypeSmall organic molecule
Emp. Form.C22H23FN4O4S
Mol. Mass.458.506
SMILESCOc1cc2[nH]c(c(CCCC(=O)NS(=O)(=O)N(C)C)c2cc1C#N)-c1ccc(F)cc1