Reaction Details
TargetIntermediate conductance calcium-activated potassium channel protein 4
LigandBDBM50371380
Substrate/Competitorn/a
Meas. Tech.ChEMBL_463302 (CHEMBL948111)
IC50 330±n/a nM
Citation McNaughton-Smith, GABurns, JFStocker, JWRigdon, GCCreech, CArrington, SShelton, Tde Franceschi, L Novel inhibitors of the Gardos channel for the treatment of sickle cell disease. J Med Chem51:976-82 (2008) 
 
Intermediate conductance calcium-activated potassium channel protein 4
Name:Intermediate conductance calcium-activated potassium channel protein 4
Type:PROTEIN
Mol. Mass.:47723.22
Organism:Homo sapiens (Human)
Description:ChEMBL_1361891
Residue:427
BDBM50371380
NameBDBM50371380
Synonyms:CHEMBL270495
TypeSmall organic molecule
Emp. Form.C21H18O2
Mol. Mass.302.3664
SMILESCOC(=O)C(c1ccccc1)(c1ccccc1)c1ccccc1