Reaction Details
TargetIntermediate conductance calcium-activated potassium channel protein 4
LigandBDBM50371392
Substrate/Competitorn/a
Meas. Tech.ChEMBL_463302 (CHEMBL948111)
IC50 1750±n/a nM
Citation McNaughton-Smith, GABurns, JFStocker, JWRigdon, GCCreech, CArrington, SShelton, Tde Franceschi, L Novel inhibitors of the Gardos channel for the treatment of sickle cell disease. J Med Chem51:976-82 (2008) 
 
Intermediate conductance calcium-activated potassium channel protein 4
Name:Intermediate conductance calcium-activated potassium channel protein 4
Type:PROTEIN
Mol. Mass.:47723.22
Organism:Homo sapiens (Human)
Description:ChEMBL_1361891
Residue:427
BDBM50371392
NameBDBM50371392
Synonyms:CHEMBL260107
TypeSmall organic molecule
Emp. Form.C21H21N
Mol. Mass.287.3981
SMILESCCNC(c1ccccc1)(c1ccccc1)c1ccccc1