Reaction Details
TargetDual specificity tyrosine-phosphorylation-regulated kinase 1A
LigandBDBM50371400
Substrate/Competitorn/a
Meas. Tech.ChEMBL_463331 (CHEMBL947132)
IC50 37±n/a nM
Citation Echalier, ABettayeb, KFerandin, YLozach, OClément, MValette, ALiger, FMarquet, BMorris, JCEndicott, JAJoseph, BMeijer, L Meriolins (3-(pyrimidin-4-yl)-7-azaindoles): synthesis, kinase inhibitory activity, cellular effects, and structure of a CDK2/cyclin A/meriolin complex. J Med Chem51:737-51 (2008) 
 
Dual specificity tyrosine-phosphorylation-regulated kinase 1A
Name:Dual specificity tyrosine-phosphorylation-regulated kinase 1A
Type:Enzyme Catalytic Domain
Mol. Mass.:85573.59
Organism:RAT
Description:Dual-specificity tyrosine-(Y)-phosphorylation regulated kinase 1A 0 RAT::Q63470
Residue:763
BDBM50371400
NameBDBM50371400
Synonyms:MERIOLIN 5
TypeSmall organic molecule
Emp. Form.C14H15N5O
Mol. Mass.269.3018
SMILESCCCOc1ccnc2[nH]cc(-c3ccnc(N)n3)c12