Reaction Details
TargetCyclin-A2/Cyclin-dependent kinase 2
LigandBDBM50371401
Substrate/Competitorn/a
Meas. Tech.ChEMBL_463326 (CHEMBL947131)
IC50 7±n/a nM
Citation Echalier, ABettayeb, KFerandin, YLozach, OClément, MValette, ALiger, FMarquet, BMorris, JCEndicott, JAJoseph, BMeijer, L Meriolins (3-(pyrimidin-4-yl)-7-azaindoles): synthesis, kinase inhibitory activity, cellular effects, and structure of a CDK2/cyclin A/meriolin complex. J Med Chem51:737-51 (2008) 
 
Cyclin-A2/Cyclin-dependent kinase 2
Name:Cyclin-A2/Cyclin-dependent kinase 2
Type:Protein Complex
Mol. Mass.:n/a
Description:Cdk2/Cyclin A kinase was purified from insect cells coinfected with Cyclin A/Cdk2 baculovirus.
Components:This complex has 2 components.
Component 1
Name:Cyclin-dependent kinase 2
Synonyms:CDK2 CDK2_HUMAN Cell division protein kinase 2 Protein cereblon/Cyclin-dependent kinase 2 | p33 protein kinase
Type:Enzyme Subunit
Mol. Mass.:33938.17
Organism:Homo sapiens (Human)
Description:P24941
Residue:298
Component 2
Name:Cyclin-A2
Synonyms:CCN1 CCNA1 CCNA2_HUMAN Cyclin-A
Type:Enzyme Subunit
Mol. Mass.:48550.19
Organism:Homo sapiens (Human)
Description:P20248
Residue:432
BDBM50371401
NameBDBM50371401
Synonyms:MERIOLIN 4
TypeSmall organic molecule
Emp. Form.C13H13N5O
Mol. Mass.255.2752
SMILESCCOc1ccnc2[nH]cc(-c3ccnc(N)n3)c12