Reaction Details
TargetCyclin-T1/Cyclin-dependent kinase 9
LigandBDBM50371402
Substrate/Competitorn/a
Meas. Tech.ChEMBL_463328 (CHEMBL947134)
IC50 6±n/a nM
Citation Echalier, ABettayeb, KFerandin, YLozach, OClément, MValette, ALiger, FMarquet, BMorris, JCEndicott, JAJoseph, BMeijer, L Meriolins (3-(pyrimidin-4-yl)-7-azaindoles): synthesis, kinase inhibitory activity, cellular effects, and structure of a CDK2/cyclin A/meriolin complex. J Med Chem51:737-51 (2008) 
 
Cyclin-T1/Cyclin-dependent kinase 9
Name:Cyclin-T1/Cyclin-dependent kinase 9
Type:Protein Complex
Mol. Mass.:n/a
Description:n/a
Components:This complex has 2 components.
Component 1
Name:Cyclin-T1
Synonyms:CCNT1 CycT Cyclin T Cyclin-T
Type:Enzyme Subunit
Mol. Mass.:80712.40
Organism:Homo sapiens (Human)
Description:n/a
Residue:726
Component 2
Name:Cyclin-dependent kinase 9
Synonyms:C-2K CDK9 Cell division cycle 2-like protein kinase 4 Cyclin-Dependent Kinase 9 (CDK9) Serine/threonine-protein kinase PITALRE Tat-associated kinase complex catalytic subunit
Type:Enzyme Subunit
Mol. Mass.:42789.13
Organism:Homo sapiens (Human)
Description:n/a
Residue:372
BDBM50371402
NameBDBM50371402
Synonyms:MERIOLIN 3
TypeSmall organic molecule
Emp. Form.C12H11N5O
Mol. Mass.241.2486
SMILESCOc1ccnc2[nH]cc(-c3ccnc(N)n3)c12