Reaction Details
TargetCyclin-dependent kinase 5 activator 1
LigandBDBM50371399
Substrate/Competitorn/a
Meas. Tech.ChEMBL_463327 (CHEMBL947133)
IC50 3±n/a nM
Citation Echalier, ABettayeb, KFerandin, YLozach, OClément, MValette, ALiger, FMarquet, BMorris, JCEndicott, JAJoseph, BMeijer, L Meriolins (3-(pyrimidin-4-yl)-7-azaindoles): synthesis, kinase inhibitory activity, cellular effects, and structure of a CDK2/cyclin A/meriolin complex. J Med Chem51:737-51 (2008) 
 
Cyclin-dependent kinase 5 activator 1
Name:Cyclin-dependent kinase 5 activator 1
Type:Protein Complex
Mol. Mass.:n/a
Description:n/a
Components:This complex has 2 components.
Component 1
Name:Cyclin-dependent kinase 5
Synonyms:CDK5 CDKN5 Cyclin-dependent kinase 5 (CDK5/ p25) Cyclin-dependent-like kinase 5 PSSALRE Tau protein kinase II catalytic subunit
Type:Enzyme Subunit
Mol. Mass.:33308.61
Organism:Homo sapiens (Human)
Description:n/a
Residue:292
Component 2
Name:Cyclin-dependent kinase 5 activator 1
Synonyms:CD5R1_HUMAN CDK5R1 Cyclin-dependent kinase 5 (CDK5/p25) NCK5A p35
Type:Enzyme Subunit
Mol. Mass.:34077.43
Organism:Homo sapiens (Human)
Description:Q15078
Residue:307
BDBM50371399
NameBDBM50371399
Synonyms:MERIOLIN 6
TypeSmall organic molecule
Emp. Form.C14H15N5O
Mol. Mass.269.3018
SMILESCC(C)Oc1ccnc2[nH]cc(-c3ccnc(N)n3)c12