Reaction Details
Target5-hydroxytryptamine receptor 7
LigandBDBM50371460
Substrate/Competitorn/a
Meas. Tech.ChEMBL_463656 (CHEMBL930824)
Ki 2.5±n/a nM
Citation Peters, JULübbers, TAlanine, AKolczewski, SBlasco, FSteward, L Cyclic guanidines as dual 5-HT5A/5-HT7 receptor ligands: structure-activity relationship elucidation. Bioorg Med Chem Lett18:256-61 (2008) 
 
5-hydroxytryptamine receptor 7
Name:5-hydroxytryptamine receptor 7
Type:G Protein-Coupled Receptor (GPCR)
Mol. Mass.:53573.08
Organism:Homo sapiens (Human)
Description:P34969
Residue:479
BDBM50371460
NameBDBM50371460
Synonyms:CHEMBL401745
TypeSmall organic molecule
Emp. Form.C11H14ClN3O
Mol. Mass.239.701
SMILESCOc1cc(Cl)c(C)c2C(C)NC(N)=Nc12