Reaction Details
Target5-hydroxytryptamine receptor 7
LigandBDBM50371462
Substrate/Competitorn/a
Meas. Tech.ChEMBL_463656 (CHEMBL930824)
Ki 1±n/a nM
Citation Peters, JULübbers, TAlanine, AKolczewski, SBlasco, FSteward, L Cyclic guanidines as dual 5-HT5A/5-HT7 receptor ligands: structure-activity relationship elucidation. Bioorg Med Chem Lett18:256-61 (2008) 
 
5-hydroxytryptamine receptor 7
Name:5-hydroxytryptamine receptor 7
Type:G Protein-Coupled Receptor (GPCR)
Mol. Mass.:53573.08
Organism:Homo sapiens (Human)
Description:P34969
Residue:479
BDBM50371462
NameBDBM50371462
Synonyms:CHEMBL258075
TypeSmall organic molecule
Emp. Form.C12H17N3O
Mol. Mass.219.2829
SMILESCC(C)Oc1cccc2C(C)NC(N)=Nc12