Reaction Details
Target5-hydroxytryptamine receptor 7
LigandBDBM50371465
Substrate/Competitorn/a
Meas. Tech.ChEMBL_463656 (CHEMBL930824)
Ki 15.3±n/a nM
Citation Peters, JULübbers, TAlanine, AKolczewski, SBlasco, FSteward, L Cyclic guanidines as dual 5-HT5A/5-HT7 receptor ligands: structure-activity relationship elucidation. Bioorg Med Chem Lett18:256-61 (2008) 
 
5-hydroxytryptamine receptor 7
Name:5-hydroxytryptamine receptor 7
Type:G Protein-Coupled Receptor (GPCR)
Mol. Mass.:53573.08
Organism:Homo sapiens (Human)
Description:P34969
Residue:479
BDBM50371465
NameBDBM50371465
Synonyms:CHEMBL269964
TypeSmall organic molecule
Emp. Form.C10H12ClN3
Mol. Mass.209.675
SMILESCNC1=Nc2cccc(Cl)c2C(C)N1