Reaction Details
TargetAcetylcholinesterase
LigandBDBM10949
Substrate/Competitorn/a
Meas. Tech.ChEMBL_463671 (CHEMBL929818)
IC50 45±n/a nM
Citation Piazzi, LCavalli, AColizzi, FBelluti, FBartolini, MMancini, FRecanatini, MAndrisano, VRampa, A Multi-target-directed coumarin derivatives: hAChE and BACE1 inhibitors as potential anti-Alzheimer compounds. Bioorg Med Chem Lett18:423-6 (2008) 
 
Acetylcholinesterase
Name:Acetylcholinesterase
Type:Enzyme
Mol. Mass.:67792.70
Organism:Homo sapiens (Human)
Description:P22303
Residue:614
BDBM10949
NameBDBM10949
Synonyms:3-(4-{[Benzyl(methyl)amino]methyl}-phenyl)-6,7-dimethoxy-2H-2-chromenone AP2238 | CHEMBL75121
TypeSmall organic molecule
Emp. Form.C26H25NO4
Mol. Mass.415.481
SMILESCOc1cc2cc(-c3ccc(CN(C)Cc4ccccc4)cc3)c(=O)oc2cc1OC