Reaction Details
TargetAcetylcholinesterase
LigandBDBM50371473
Substrate/Competitorn/a
Meas. Tech.ChEMBL_463671 (CHEMBL929818)
IC50 7160±n/a nM
Citation Piazzi, LCavalli, AColizzi, FBelluti, FBartolini, MMancini, FRecanatini, MAndrisano, VRampa, A Multi-target-directed coumarin derivatives: hAChE and BACE1 inhibitors as potential anti-Alzheimer compounds. Bioorg Med Chem Lett18:423-6 (2008) 
 
Acetylcholinesterase
Name:Acetylcholinesterase
Type:Enzyme
Mol. Mass.:67792.70
Organism:Homo sapiens (Human)
Description:P22303
Residue:614
BDBM50371473
NameBDBM50371473
Synonyms:CHEMBL239046
TypeSmall organic molecule
Emp. Form.C36H32F2N2O4
Mol. Mass.594.6471
SMILESCCN(Cc1ccccc1)Cc1ccc(cc1)-c1cc2cc(OCCNC(=O)\C=C\c3cc(F)cc(F)c3)ccc2oc1=O