Reaction Details
TargetSteroid 17-alpha-hydroxylase/17,20 lyase
LigandBDBM25458
Substrate/Competitorn/a
Meas. Tech.ChEMBL_463680 (CHEMBL931793)
IC50 220±n/a nM
Citation Jagusch, CNegri, MHille, UEHu, QBartels, MJahn-Hoffmann, KPinto-Bazurco Mendieta, MARodenwaldt, BMüller-Vieira, USchmidt, DLauterbach, TRecanatini, MCavalli, AHartmann, RW Synthesis, biological evaluation and molecular modelling studies of methyleneimidazole substituted biaryls as inhibitors of human 17alpha-hydroxylase-17,20-lyase (CYP17). Part I: Heterocyclic modifications of the core structure. Bioorg Med Chem16:1992-2010 (2008) 
 
Steroid 17-alpha-hydroxylase/17,20 lyase
Name:Steroid 17-alpha-hydroxylase/17,20 lyase
Type:Enzyme
Mol. Mass.:57255.68
Organism:Rattus norvegicus (Rat)
Description:P11715
Residue:507
BDBM25458
NameBDBM25458
Synonyms:(1S,2R,5S,10R,11S,15S)-2,15-dimethyl-14-(pyridin-3-yl)tetracyclo[8.7.0.0^{2,7}.0^{11,15}]heptadeca-7,13-dien-5-ol Abiraterone CHEMBL254328 US9611270, Example 5, abiraterone
Typesteroidal compound
Emp. Form.C24H31NO
Mol. Mass.349.509
SMILES[H][C@@]12CC=C(c3cccnc3)[C@@]1(C)CC[C@@]1([H])[C@@]2([H])CC=C2C[C@@H](O)CC[C@]12C