Reaction Details
TargetC-X-C chemokine receptor type 3
LigandBDBM50371491
Substrate/Competitorn/a
Meas. Tech.ChEMBL_463732 (CHEMBL932090)
IC50 4.8±n/a nM
Citation Du, XChen, XMihalic, JTDeignan, JDuquette, JLi, ARLemon, BMa, JMiao, SEbsworth, KSullivan, TJTonn, GCollins, TLMedina, JC Design and optimization of imidazole derivatives as potent CXCR3 antagonists. Bioorg Med Chem Lett18:608-13 (2008) 
 
C-X-C chemokine receptor type 3
Name:C-X-C chemokine receptor type 3
Type:Enzyme Catalytic Domain
Mol. Mass.:40665.65
Organism:Homo sapiens (Human)
Description:n/a
Residue:368
BDBM50371491
NameBDBM50371491
Synonyms:CHEMBL403086
TypeSmall organic molecule
Emp. Form.C34H37N5O4S
Mol. Mass.611.754
SMILESCCOc1ccc(cc1)-n1cc(nc1[C@@H](C)N(CCS(=O)(=O)CC)C(=O)Cn1cnc(c1)-c1ccccc1)-c1ccccc1