Reaction Details
TargetC-X-C chemokine receptor type 3
LigandBDBM50371511
Substrate/Competitorn/a
Meas. Tech.ChEMBL_463732 (CHEMBL932090)
IC50 2.3±n/a nM
Citation Du, XChen, XMihalic, JTDeignan, JDuquette, JLi, ARLemon, BMa, JMiao, SEbsworth, KSullivan, TJTonn, GCollins, TLMedina, JC Design and optimization of imidazole derivatives as potent CXCR3 antagonists. Bioorg Med Chem Lett18:608-13 (2008) 
 
C-X-C chemokine receptor type 3
Name:C-X-C chemokine receptor type 3
Type:Enzyme Catalytic Domain
Mol. Mass.:40665.65
Organism:Homo sapiens (Human)
Description:n/a
Residue:368
BDBM50371511
NameBDBM50371511
Synonyms:CHEMBL272720
TypeSmall organic molecule
Emp. Form.C30H27F4N5O3S
Mol. Mass.613.626
SMILESCCS(=O)(=O)CCN([C@H](C)c1nc(cn1-c1ccc(cc1)C#N)-c1cccnc1)C(=O)Cc1ccc(F)c(c1)C(F)(F)F