Reaction Details
TargetC-X-C chemokine receptor type 3
LigandBDBM50371515
Substrate/Competitorn/a
Meas. Tech.ChEMBL_463732 (CHEMBL932090)
IC50 5.6±n/a nM
Citation Du, XChen, XMihalic, JTDeignan, JDuquette, JLi, ARLemon, BMa, JMiao, SEbsworth, KSullivan, TJTonn, GCollins, TLMedina, JC Design and optimization of imidazole derivatives as potent CXCR3 antagonists. Bioorg Med Chem Lett18:608-13 (2008) 
 
C-X-C chemokine receptor type 3
Name:C-X-C chemokine receptor type 3
Type:Enzyme Catalytic Domain
Mol. Mass.:40665.65
Organism:Homo sapiens (Human)
Description:n/a
Residue:368
BDBM50371515
NameBDBM50371515
Synonyms:CHEMBL271250
TypeSmall organic molecule
Emp. Form.C33H36N6O4S
Mol. Mass.612.742
SMILESCCOc1ccc(cc1)-n1cc(nc1[C@@H](C)N(CCS(=O)(=O)CC)C(=O)Cn1cc(nn1)-c1ccccc1)-c1ccccc1