Reaction Details
TargetNPC1-like intracellular cholesterol transporter 1
LigandBDBM50371528
Substrate/Competitorn/a
Meas. Tech.ChEMBL_463744 (CHEMBL932102)
Ki 9200±n/a nM
Citation Pfefferkorn, JALarsen, SDVan Huis, CSorenson, RBarton, TWinters, TAuerbach, BWu, CWolfram, TJCai, HWelch, KEsmaiel, NDavis, JBousley, ROlsen, KMueller, SBMertz, T Substituted oxazolidinones as novel NPC1L1 ligands for the inhibition of cholesterol absorption. Bioorg Med Chem Lett18:546-53 (2008) 
 
NPC1-like intracellular cholesterol transporter 1
Name:NPC1-like intracellular cholesterol transporter 1
Type:PROTEIN
Mol. Mass.:146415.18
Organism:Rattus norvegicus
Description:ChEMBL_463744
Residue:1331
BDBM50371528
NameBDBM50371528
Synonyms:CHEMBL257850
TypeSmall organic molecule
Emp. Form.C24H22FNO5
Mol. Mass.423.4336
SMILESO[C@H](CCc1ccccc1)[C@H]1OC(=O)N([C@@H]1c1ccc(O)cc1O)c1ccc(F)cc1