Reaction Details
TargetNPC1-like intracellular cholesterol transporter 1
LigandBDBM50371544
Substrate/Competitorn/a
Meas. Tech.ChEMBL_463744 (CHEMBL932102)
Ki>50000±n/a nM
Citation Pfefferkorn, JALarsen, SDVan Huis, CSorenson, RBarton, TWinters, TAuerbach, BWu, CWolfram, TJCai, HWelch, KEsmaiel, NDavis, JBousley, ROlsen, KMueller, SBMertz, T Substituted oxazolidinones as novel NPC1L1 ligands for the inhibition of cholesterol absorption. Bioorg Med Chem Lett18:546-53 (2008) 
 
NPC1-like intracellular cholesterol transporter 1
Name:NPC1-like intracellular cholesterol transporter 1
Type:PROTEIN
Mol. Mass.:146415.18
Organism:Rattus norvegicus
Description:ChEMBL_463744
Residue:1331
BDBM50371544
NameBDBM50371544
Synonyms:CHEMBL272303
TypeSmall organic molecule
Emp. Form.C24H22FNO6
Mol. Mass.439.433
SMILESCOc1ccc(OC[C@@H](O)[C@H]2OC(=O)N([C@@H]2c2ccc(O)cc2)c2ccc(F)cc2)cc1