Reaction Details
TargetAcetylcholinesterase
LigandBDBM50371550
Substrate/Competitorn/a
Meas. Tech.ChEMBL_463759 (CHEMBL932016)
IC50 10±n/a nM
Citation Fang, LAppenroth, DDecker, MKiehntopf, MRoegler, CDeufel, TFleck, CPeng, SZhang, YLehmann, J Synthesis and biological evaluation of NO-donor-tacrine hybrids as hepatoprotective anti-Alzheimer drug candidates. J Med Chem51:713-6 (2008) 
 
Acetylcholinesterase
Name:Acetylcholinesterase
Type:Enzyme
Mol. Mass.:67792.70
Organism:Homo sapiens (Human)
Description:P22303
Residue:614
BDBM50371550
NameBDBM50371550
Synonyms:CHEMBL272229
TypeSmall organic molecule
Emp. Form.C18H24N4O3
Mol. Mass.344.4082
SMILES[O-][N+](=O)OCCNCCCNc1c2CCCCc2nc2ccccc12