Reaction Details
TargetFalcipain 2
LigandBDBM50371567
Substrate/Competitorn/a
Meas. Tech.ChEMBL_463775 (CHEMBL931126)
Ki 110±n/a nM
Citation Ettari, RNizi, EDi Francesco, MEDude, MAPradel, GVicík, RSchirmeister, TMicale, NGrasso, SZappalà, M Development of peptidomimetics with a vinyl sulfone warhead as irreversible falcipain-2 inhibitors. J Med Chem51:988-96 (2008) 
 
Falcipain 2
Name:Falcipain 2
Type:Enzyme
Mol. Mass.:55912.60
Organism:Plasmodium falciparum
Description:Recombinant falcipain-2.
Residue:484
BDBM50371567
NameBDBM50371567
Synonyms:CHEMBL270278
TypeSmall organic molecule
Emp. Form.C31H28ClF3N4O6S
Mol. Mass.677.09
SMILESCCS(=O)(=O)C=CCNC(=O)CN1c2ccccc2C(=N[C@H](COC(=O)Nc2ccc(Cl)cc2C(F)(F)F)C1=O)c1ccccc1