Reaction Details
TargetP2Y purinoceptor 12
LigandBDBM50371582
Substrate/Competitorn/a
Meas. Tech.ChEMBL_463779 (CHEMBL931130)
IC50 36.2±n/a nM
Citation Douglass, JGPatel, RIYerxa, BRShaver, SRWatson, PSBednarski, KPlourde, RRedick, CCBrubaker, KJones, ACBoyer, JL Lipophilic modifications to dinucleoside polyphosphates and nucleotides that confer antagonist properties at the platelet P2Y12 receptor. J Med Chem51:1007-25 (2008) 
 
P2Y purinoceptor 12
Name:P2Y purinoceptor 12
Type:Enzyme
Mol. Mass.:39458.48
Organism:Homo sapiens (Human)
Description:Q9H244
Residue:342
BDBM50371582
NameBDBM50371582
Synonyms:CHEMBL1162182
TypeSmall organic molecule
Emp. Form.C24H29N6O8P
Mol. Mass.560.4962
SMILESOP(O)(=O)OC[C@H]1O[C@H]([C@@H]2OC(Cc3ccccc3)O[C@H]12)n1cnc2c(NC(=O)NC3CCCC3)ncnc12