Reaction Details
TargetP2Y purinoceptor 12
LigandBDBM50371585
Substrate/Competitorn/a
Meas. Tech.ChEMBL_463779 (CHEMBL931130)
IC50 160±n/a nM
Citation Douglass, JGPatel, RIYerxa, BRShaver, SRWatson, PSBednarski, KPlourde, RRedick, CCBrubaker, KJones, ACBoyer, JL Lipophilic modifications to dinucleoside polyphosphates and nucleotides that confer antagonist properties at the platelet P2Y12 receptor. J Med Chem51:1007-25 (2008) 
 
P2Y purinoceptor 12
Name:P2Y purinoceptor 12
Type:Enzyme
Mol. Mass.:39458.48
Organism:Homo sapiens (Human)
Description:Q9H244
Residue:342
BDBM50371585
NameBDBM50371585
Synonyms:CHEMBL1162188
TypeSmall organic molecule
Emp. Form.C25H25N6O8P
Mol. Mass.568.4752
SMILESOP(O)(=O)OC[C@H]1O[C@H]([C@@H]2OC(Cc3ccccc3)O[C@H]12)n1cnc2c(NC(=O)Nc3ccccc3)ncnc12