Reaction Details
TargetP2Y purinoceptor 12
LigandBDBM50371589
Substrate/Competitorn/a
Meas. Tech.ChEMBL_463779 (CHEMBL931130)
IC50 48±n/a nM
Citation Douglass, JGPatel, RIYerxa, BRShaver, SRWatson, PSBednarski, KPlourde, RRedick, CCBrubaker, KJones, ACBoyer, JL Lipophilic modifications to dinucleoside polyphosphates and nucleotides that confer antagonist properties at the platelet P2Y12 receptor. J Med Chem51:1007-25 (2008) 
 
P2Y purinoceptor 12
Name:P2Y purinoceptor 12
Type:Enzyme
Mol. Mass.:39458.48
Organism:Homo sapiens (Human)
Description:Q9H244
Residue:342
BDBM50371589
NameBDBM50371589
Synonyms:CHEMBL1162196
TypeSmall organic molecule
Emp. Form.C34H39N5O22P4
Mol. Mass.993.5888
SMILESNc1ccn([C@@H]2O[C@H](COP(O)(=O)OP(O)(=O)OP(O)(=O)OP(O)(=O)OC[C@@H]3O[C@@H]([C@H]4O[C@@H](Cc5ccccc5)O[C@@H]34)n3ccc(=O)[nH]c3=O)[C@H]3O[C@@H](Cc4ccccc4)O[C@@H]23)c(=O)n1