Reaction Details
TargetP2Y purinoceptor 2
LigandBDBM50371598
Substrate/Competitorn/a
Meas. Tech.ChEMBL_463782 (CHEMBL932171)
EC50 52±n/a nM
Citation Douglass, JGPatel, RIYerxa, BRShaver, SRWatson, PSBednarski, KPlourde, RRedick, CCBrubaker, KJones, ACBoyer, JL Lipophilic modifications to dinucleoside polyphosphates and nucleotides that confer antagonist properties at the platelet P2Y12 receptor. J Med Chem51:1007-25 (2008) 
 
P2Y purinoceptor 2
Name:P2Y purinoceptor 2
Type:PROTEIN
Mol. Mass.:42299.21
Organism:Homo sapiens (Human)
Description:ChEMBL_1455361
Residue:377
BDBM50371598
NameBDBM50371598
Synonyms:CHEMBL1162170
TypeSmall organic molecule
Emp. Form.C28H34N10O19P4
Mol. Mass.938.5202
SMILESNc1ncnc2n(cnc12)[C@H]1O[C@@H](COP(O)(=O)OP(O)(=O)OP(O)(=O)OP(O)(=O)OC[C@H]2O[C@H]([C@@H]3OC(Cc4ccccc4)O[C@H]23)n2cnc3c(N)ncnc23)[C@H](O)[C@@H]1O