Reaction Details
TargetInduced myeloid leukemia cell differentiation protein Mcl-1
LigandBDBM50371612
Substrate/Competitorn/a
Meas. Tech.ChEMBL_463795 (CHEMBL932184)
Ki 150±n/a nM
Citation Tang, GNikolovska-Coleska, ZQiu, SYang, CYGuo, JWang, S Acylpyrogallols as inhibitors of antiapoptotic Bcl-2 proteins. J Med Chem51:717-20 (2008) 
 
Induced myeloid leukemia cell differentiation protein Mcl-1
Name:Induced myeloid leukemia cell differentiation protein Mcl-1
Type:Membrane; Single-pass membrane protein
Mol. Mass.:37332.87
Organism:Homo sapiens (Human)
Description:Q07820
Residue:350
BDBM50371612
NameBDBM50371612
Synonyms:CHEMBL259034
TypeSmall organic molecule
Emp. Form.C30H20O6
Mol. Mass.476.4762
SMILESOc1c(O)c(cc(C(=O)c2cccc3ccccc23)c1O)C(=O)c1ccc(Oc2ccccc2)cc1