Reaction Details
TargetB1 bradykinin receptor
LigandBDBM50371651
Substrate/Competitorn/a
Meas. Tech.ChEMBL_463823 (CHEMBL948902)
Ki 0.2±n/a nM
Citation Feng, DMDiPardo, RMWai, JMChang, RKDi Marco, CNMurphy, KLRansom, RWReiss, DRTang, CPrueksaritanont, TPettibone, DJBock, MGKuduk, SD A new class of bradykinin B1 receptor antagonists with high oral bioavailability and minimal PXR activity. Bioorg Med Chem Lett18:682-7 (2008) B1 bradykinin receptor
Name:B1 bradykinin receptor
Type:Enzyme
Mol. Mass.:40508.87
Organism:Homo sapiens (Human)
Description:P46663
Residue:353
BDBM50371651
NameBDBM50371651
Synonyms:CHEMBL410281
TypeSmall organic molecule
Emp. Form.C23H18Cl3F3N4O4
Mol. Mass.577.768
SMILESC[C@@H](NC(=O)C1(CC1)NC(=O)c1cc(Cl)no1)c1ncc(cc1F)-c1cc(Cl)cc(Cl)c1OCC(F)F