Reaction Details
TargetGrowth hormone secretagogue receptor type 1
LigandBDBM50371697
Substrate/Competitorn/a
Meas. Tech.ChEMBL_463848 (CHEMBL934042)
EC50 62±n/a nM
Citation Hernández, ASSwartz, SGSlusarchyk, DYan, MSeethala, RKSleph, PGrover, GDickinson, KGiupponi, LHarper, TWHumphreys, WGLonghi, DAFlynn, NMurphy, BJGordon, DABiller, SARobl, JATino, JA Optimization of 1H-tetrazole-1-alkanenitriles as potent orally bioavailable growth hormone secretagogues. Bioorg Med Chem Lett18:2067-72 (2008) 
 
Growth hormone secretagogue receptor type 1
Name:Growth hormone secretagogue receptor type 1
Type:Receptor
Mol. Mass.:41334.57
Organism:Homo sapiens (Human)
Description:Receptor binding studies use plasma membranes from LLC PK-1 cells transiently transfected with hGHSR1a.
Residue:366
BDBM50371697
NameBDBM50371697
Synonyms:CHEMBL404336
TypeSmall organic molecule
Emp. Form.C25H29N7O2
Mol. Mass.459.5435
SMILESCC(C)(N)C(=O)N[C@H](COCc1ccccc1)c1nnnn1C(CC#N)\C=C\c1ccccc1