Reaction Details
TargetCytochrome P450 2C19
LigandBDBM50371684
Substrate/Competitorn/a
Meas. Tech.ChEMBL_463854 (CHEMBL934048)
IC50 42000±n/a nM
Citation Hernández, ASSwartz, SGSlusarchyk, DYan, MSeethala, RKSleph, PGrover, GDickinson, KGiupponi, LHarper, TWHumphreys, WGLonghi, DAFlynn, NMurphy, BJGordon, DABiller, SARobl, JATino, JA Optimization of 1H-tetrazole-1-alkanenitriles as potent orally bioavailable growth hormone secretagogues. Bioorg Med Chem Lett18:2067-72 (2008) 
 
Cytochrome P450 2C19
Name:Cytochrome P450 2C19
Type:Enzyme
Mol. Mass.:55935.47
Organism:Homo sapiens (Human)
Description:P33261
Residue:490
BDBM50371684
NameBDBM50371684
Synonyms:CHEMBL270666
TypeSmall organic molecule
Emp. Form.C24H29N7O4
Mol. Mass.479.5316
SMILESCC(C)(N)C(=O)N[C@H](COCc1ccccc1)c1nnnn1[C@@H](COc1ccccc1O)CC#N