Reaction Details
TargetP2Y purinoceptor 2
LigandBDBM50227016
Substrate/Competitorn/a
Meas. Tech.ChEMBL_463988 (CHEMBL929975)
IC50 30000±n/a nM
Citation Weyler, SBaqi, YHillmann, PKaulich, MHunder, AMMüller, IAMüller, CE Combinatorial synthesis of anilinoanthraquinone derivatives and evaluation as non-nucleotide-derived P2Y2 receptor antagonists. Bioorg Med Chem Lett18:223-7 (2008) 
 
P2Y purinoceptor 2
Name:P2Y purinoceptor 2
Type:PROTEIN
Mol. Mass.:42202.78
Organism:Mus musculus
Description:ChEMBL_587770
Residue:373
BDBM50227016
NameBDBM50227016
Synonyms:CHEMBL401859 sodium 1-amino-9,10-dioxo-4-(4-(phenylamino)phenylamino)-9,10-dihydroanthracene-2-sulfonate
TypeSmall organic molecule
Emp. Form.C26H18N3O5S
Mol. Mass.484.504
SMILESNc1c2C(=O)c3ccccc3C(=O)c2c(Nc2ccc(Nc3ccccc3)cc2)cc1S([O-])(=O)=O