Reaction Details
TargetP2Y purinoceptor 2
LigandBDBM50371700
Substrate/Competitorn/a
Meas. Tech.ChEMBL_463988 (CHEMBL929975)
IC50>100000±n/a nM
Citation Weyler, SBaqi, YHillmann, PKaulich, MHunder, AMMüller, IAMüller, CE Combinatorial synthesis of anilinoanthraquinone derivatives and evaluation as non-nucleotide-derived P2Y2 receptor antagonists. Bioorg Med Chem Lett18:223-7 (2008) 
 
P2Y purinoceptor 2
Name:P2Y purinoceptor 2
Type:PROTEIN
Mol. Mass.:42202.78
Organism:Mus musculus
Description:ChEMBL_587770
Residue:373
BDBM50371700
NameBDBM50371700
Synonyms:CHEMBL271689
TypeSmall organic molecule
Emp. Form.C22H15N2O6S
Mol. Mass.435.43
SMILESCC(=O)c1ccc(Nc2cc(c(N)c3C(=O)c4ccccc4C(=O)c23)S([O-])(=O)=O)cc1