Reaction Details
TargetP2Y purinoceptor 2
LigandBDBM50336788
Substrate/Competitorn/a
Meas. Tech.ChEMBL_463988 (CHEMBL929975)
IC50 27000±n/a nM
Citation Weyler, SBaqi, YHillmann, PKaulich, MHunder, AMMüller, IAMüller, CE Combinatorial synthesis of anilinoanthraquinone derivatives and evaluation as non-nucleotide-derived P2Y2 receptor antagonists. Bioorg Med Chem Lett18:223-7 (2008) 
 
P2Y purinoceptor 2
Name:P2Y purinoceptor 2
Type:PROTEIN
Mol. Mass.:42202.78
Organism:Mus musculus
Description:ChEMBL_587770
Residue:373
BDBM50336788
NameBDBM50336788
Synonyms:CHEMBL404450 sodium 4-(p-toluidino)-1-amino-9,10-dioxo-9,10-dihydroanthracene-2-sulfonate
TypeSmall organic molecule
Emp. Form.C21H15N2O5S
Mol. Mass.407.42
SMILESCc1ccc(Nc2cc(c(N)c3C(=O)c4ccccc4C(=O)c23)S([O-])(=O)=O)cc1