Reaction Details
TargetP2Y purinoceptor 2
LigandBDBM50227015
Substrate/Competitorn/a
Meas. Tech.ChEMBL_463989 (CHEMBL929976)
IC50 5810±n/a nM
Citation Weyler, SBaqi, YHillmann, PKaulich, MHunder, AMMüller, IAMüller, CE Combinatorial synthesis of anilinoanthraquinone derivatives and evaluation as non-nucleotide-derived P2Y2 receptor antagonists. Bioorg Med Chem Lett18:223-7 (2008) 
 
P2Y purinoceptor 2
Name:P2Y purinoceptor 2
Type:PROTEIN
Mol. Mass.:42299.21
Organism:Homo sapiens (Human)
Description:ChEMBL_1455361
Residue:377
BDBM50227015
NameBDBM50227015
Synonyms:CHEMBL271688 sodium 4-(4-acetamidophenylamino)-1-amino-9,10-dioxo-9,10-dihydroanthracene-2-sulfonate
TypeSmall organic molecule
Emp. Form.C22H16N3O6S
Mol. Mass.450.444
SMILESCC(=O)Nc1ccc(Nc2cc(c(N)c3C(=O)c4ccccc4C(=O)c23)S([O-])(=O)=O)cc1