Reaction Details
TargetP2Y purinoceptor 2
LigandBDBM50227032
Substrate/Competitorn/a
Meas. Tech.ChEMBL_463989 (CHEMBL929976)
IC50 5610±n/a nM
Citation Weyler, SBaqi, YHillmann, PKaulich, MHunder, AMMüller, IAMüller, CE Combinatorial synthesis of anilinoanthraquinone derivatives and evaluation as non-nucleotide-derived P2Y2 receptor antagonists. Bioorg Med Chem Lett18:223-7 (2008) 
 
P2Y purinoceptor 2
Name:P2Y purinoceptor 2
Type:PROTEIN
Mol. Mass.:42299.21
Organism:Homo sapiens (Human)
Description:ChEMBL_1455361
Residue:377
BDBM50227032
NameBDBM50227032
Synonyms:CHEMBL256057 sodium 1-amino-9,10-dioxo-4-(phenylamino)-9,10-dihydroanthracene-2-sulfonate
TypeSmall organic molecule
Emp. Form.C20H13N2O5S
Mol. Mass.393.393
SMILESNc1c2C(=O)c3ccccc3C(=O)c2c(Nc2ccccc2)cc1S([O-])(=O)=O