Reaction Details
Target5'-nucleotidase
LigandBDBM50336767
Substrate/Competitorn/a
Meas. Tech.ChEMBL_463991 (CHEMBL929978)
Ki>100000±n/a nM
Citation Weyler, SBaqi, YHillmann, PKaulich, MHunder, AMMüller, IAMüller, CE Combinatorial synthesis of anilinoanthraquinone derivatives and evaluation as non-nucleotide-derived P2Y2 receptor antagonists. Bioorg Med Chem Lett18:223-7 (2008) 
 
5'-nucleotidase
Name:5'-nucleotidase
Type:Enzyme
Mol. Mass.:63971.44
Organism:Rattus norvegicus (Rat)
Description:P21588
Residue:576
BDBM50336767
NameBDBM50336767
Synonyms:CHEMBL257495 sodium 1-amino-4-(2-methoxyphenylamino)-9,10-dioxo-9,10-dihydroanthracene-2-sulfonate
TypeSmall organic molecule
Emp. Form.C21H15N2O6S
Mol. Mass.423.419
SMILESCOc1ccccc1Nc1cc(c(N)c2C(=O)c3ccccc3C(=O)c12)S([O-])(=O)=O