Reaction Details
TargetC-X-C chemokine receptor type 2
LigandBDBM50371771
Substrate/Competitorn/a
Meas. Tech.ChEMBL_464067 (CHEMBL949060)
IC50 2±n/a nM
Citation Walters, IAustin, CAustin, RBonnert, RCage, PChristie, MEbden, MGardiner, SGrahames, CHill, SHunt, FJewell, RLewis, SMartin, IDavid Nicholls, naDavid Robinson, na Evaluation of a series of bicyclic CXCR2 antagonists. Bioorg Med Chem Lett18:798-803 (2008) C-X-C chemokine receptor type 2
Name:C-X-C chemokine receptor type 2
Type:Protein
Mol. Mass.:40767.88
Organism:Homo sapiens (Human)
Description:P25025
Residue:360
BDBM50371771
NameBDBM50371771
Synonyms:CHEMBL271012
TypeSmall organic molecule
Emp. Form.C15H15FN4O2S2
Mol. Mass.366.434
SMILESC[C@H](CO)Nc1[nH]c(SCc2ccccc2F)nc2nc(=O)sc12