Reaction Details
TargetC-X-C chemokine receptor type 2
LigandBDBM50371789
Substrate/Competitorn/a
Meas. Tech.ChEMBL_464067 (CHEMBL949060)
IC50 1±n/a nM
Citation Walters, IAustin, CAustin, RBonnert, RCage, PChristie, MEbden, MGardiner, SGrahames, CHill, SHunt, FJewell, RLewis, SMartin, IDavid Nicholls, naDavid Robinson, na Evaluation of a series of bicyclic CXCR2 antagonists. Bioorg Med Chem Lett18:798-803 (2008) C-X-C chemokine receptor type 2
Name:C-X-C chemokine receptor type 2
Type:Protein
Mol. Mass.:40767.88
Organism:Homo sapiens (Human)
Description:P25025
Residue:360
BDBM50371789
NameBDBM50371789
Synonyms:CHEMBL256668
TypeSmall organic molecule
Emp. Form.C16H15F2N5O2S
Mol. Mass.379.384
SMILESC[C@H](CO)Nc1nc(SCc2cccc(F)c2F)nc2[nH]c(=O)cnc12