Reaction Details
TargetMacrophage colony-stimulating factor 1 receptor
LigandBDBM50371929
Substrate/Competitorn/a
Meas. Tech.ChEMBL_464342 (CHEMBL951197)
IC50 360±n/a nM
Citation Wall, MJChen, JMeegalla, SBallentine, SKWilson, KJDesJarlais, RLSchubert, CChaikin, MACrysler, CPetrounia, IPDonatelli, RRYurkow, EJBoczon, LMazzulla, MPlayer, MRPatch, RJManthey, CLMolloy, CTomczuk, BIllig, CR Synthesis and evaluation of novel 3,4,6-substituted 2-quinolones as FMS kinase inhibitors. Bioorg Med Chem Lett18:2097-102 (2008) 
 
Macrophage colony-stimulating factor 1 receptor
Name:Macrophage colony-stimulating factor 1 receptor
Type:Protein
Mol. Mass.:107979.48
Organism:Homo sapiens (Human)
Description:P07333
Residue:972
BDBM50371929
NameBDBM50371929
Synonyms:CHEMBL257456
TypeSmall organic molecule
Emp. Form.C19H13ClN2O
Mol. Mass.320.772
SMILESClc1ccc2[nH]c(=O)c(-c3ccc[nH]3)c(-c3ccccc3)c2c1