Reaction Details
TargetMacrophage colony-stimulating factor 1 receptor
LigandBDBM50371915
Substrate/Competitorn/a
Meas. Tech.ChEMBL_464342 (CHEMBL951197)
IC50 2.5±n/a nM
Citation Wall, MJChen, JMeegalla, SBallentine, SKWilson, KJDesJarlais, RLSchubert, CChaikin, MACrysler, CPetrounia, IPDonatelli, RRYurkow, EJBoczon, LMazzulla, MPlayer, MRPatch, RJManthey, CLMolloy, CTomczuk, BIllig, CR Synthesis and evaluation of novel 3,4,6-substituted 2-quinolones as FMS kinase inhibitors. Bioorg Med Chem Lett18:2097-102 (2008) 
 
Macrophage colony-stimulating factor 1 receptor
Name:Macrophage colony-stimulating factor 1 receptor
Type:Protein
Mol. Mass.:107979.48
Organism:Homo sapiens (Human)
Description:P07333
Residue:972
BDBM50371915
NameBDBM50371915
Synonyms:CHEMBL273198
TypeSmall organic molecule
Emp. Form.C22H18N4O
Mol. Mass.354.4045
SMILESCCc1ccc(cc1)-c1c(-c2c[nH]c(C)n2)c(=O)[nH]c2ccc(cc12)C#N